{"text_format":"1","workbook":"xlsx","n_sheets":6,"sheets":["Inscription","Animaux","T_RACE","T_RACE_VLOOKUP","Combo","InsDet"],"not_rendered":{"charts":0,"images":0,"macros":1,"external_links":0,"defined_names":3,"comments":2,"pivot_tables":0},"unopened":[],"bounds":{"document_bytes":16777216,"sheet_cells":100000,"rows_first":2000,"rows_last":500,"rows_between":2000,"halvings":0,"cell_chars":16384,"cell_head_chars":4096},"cells_cut":0,"cells_raw":0,"read":"whole","date_system":"1900"}

{"sheet":"Inscription","index":0,"n_rows":25,"n_cols":7,"rows_kept":25,"cut":false,"hidden":false,"merged":[[0,0,0,1],[1,0,1,1],[0,6,0,7],[1,6,1,7],[0,2,0,4]]}
[null,null,"Bulletin d'inscription",null,null,"NOM ","Briatte "]
[null,null,null,null,null,"PRENOM","Vincent"]
["#","Catégorie*","Race, variété (Obligatoire)","Sexe (M/F)","Age (J/A)","Bague/Tatouage","Pr. Vente"]
[1]
[2]
[3]
[4]
[5]
[6]
[7]
[8]
[9]
[10]
[11]
[12]
[13]
[14]
[15]
[16]
[17]
[18]
[19]
[20]
[]
["Catégorie - Vollailles Naines(VN), Grandes Vollailles(GV), Lapins(LA), Pigeons(PI), Oiseaux de Parc(OP), Aquatiques(Aqua)",null,null,"Les mises en vente à l'enlogement seront facturées 1€ supplémentaire"]

{"sheet":"Animaux","index":1,"n_rows":2451,"n_cols":9,"rows_kept":2451,"cut":false,"hidden":true,"merged":[]}
["Nom","CodeAni","Tri","Taille","Nom2","Champion","Image","Nom3","Nom4"]
["Abyssiniens Ttes Couleurs","080200",false,"1","",1,"","",""]
["African Owl                   ","480100",false,"1","",1,"","",""]
["African Owl Blanc","480103",false,"1","",1,"","",""]
["African Owl Bleu Barré","480104",false,"1","",1,"","",""]
["African Owl Dun               ","480102",false,"1","",1,"","",""]
["African Owl Noir              ","480101",false,"1","",1,"","",""]
["Agouti","080051",false,"1","",1,"","",""]
["Agouti Argenté","080052",false,"1","",1,"","",""]
["Agouti Doré","080054",false,"1","",1,"","",""]
["Agouti Gris","080058",false,"1","",1,"","",""]
["Agouti Saumon","080056",false,"1","",1,"","",""]
["Alaska","020100",false,"6","",1,"","",""]
["Allemande Dorée","330150",false,"1","",1,"","",""]
["Allemande Orangée","330155",false,"1","",1,"","",""]
["Alouette Charbonniere","450350",false,"1","",1,"","",""]
["Alouette Cobourg Arg Unie","410101",false,"1","",1,"","",""]
["Alouette Cobourg Argent Barree","410102",false,"1","",1,"","",""]
["Alouette De Cobourg           ","410100",false,"1","",1,"","",""]
["Alouette De Cobourg Ecaillée","410104",false,"1","",1,"","",""]
["Alouette De Cobourg Unie","410108",false,"1","",1,"","",""]
["Alouette De Nuremberg","450100",false,"1","",1,"","",""]
["Alouette De Nuremberg Barre","450102",false,"1","",1,"","",""]
["Alouette De Nuremberg Maille  ","450101",false,"1","",1,"","",""]
["Alouette De Nuremberg Uni","450103",false,"1","",1,"","",""]
["Alsace                        ","720100",false,"1","",1,"","",""]
["Alsace Blanche                ","720102",false,"1","",1,"","",""]
["Alsace Grise                  ","720101",false,"1","",1,"","",""]
["Alsacienne                    ","310100",false,"1","",1,"","",""]
["Alsacienne Blanche            ","310103",false,"1","",1,"","",""]
["Alsacienne Bleue              ","310104",false,"1","",1,"","",""]
["Alsacienne Noire              ","310101",false,"1","",1,"","",""]
["Alsacienne Perdrix            ","310102",false,"1","",1,"","",""]
["Altenbourg Bleu Barre","460301",false,"1","",1,"","",""]
["Altenbourg Jaune Cendre","460308",false,"1","",1,"","",""]
["Amrocks                       ","320100",false,"1","",1,"","",""]
["Anatolie","481408",false,"1","",1,"","",""]
["Ancien Cravaté All. Bleu Barré","480303",false,"1","",1,"","",""]
["Ancone                        ","320200",false,"1","",1,"","",""]
["Andalouse ( Naine )           ","330200",false,"1","",1,"","",""]
["Andalouse Bleue Gr            ","320300",false,"1","",1,"","",""]
["Anes De Provence","800005",false,"7","",1,"","",""]
["Anes Nains","800003",false,"7","",1,"","",""]
["Anesse","800004",false,"7","",1,"","",""]
["Angora  Blanc N","060101",false,"2","",1,"","",""]
["Angora Bicolore","060110",false,"1","",1,"","",""]
["Angora Blanc","040100",false,"1","",1,"","",""]
["Angora Blanc Tachetee","060103",false,"2","",1,"","",""]
["Angora Bleu","060109",false,"1","",1,"","",""]
["Angora Chamois","060102",false,"2","",1,"","",""]
["Angora Francais Gr","040101",false,"6","",1,"","",""]
["Angora Nain","060100",false,"1","",1,"","",""]
["Angora Noir","060104",false,"2","",1,"","",""]
["Angora Orange","060105",false,"2","",1,"","",""]
["Angora Russe","060106",false,"2","",1,"","",""]
["Angora Russe Fauve","060107",false,"2","",1,"","",""]
["Angora Siamois","060108",false,"2","",1,"","",""]
["Appenzelloise A Camail Dore   ","320402",false,"1","",1,"","",""]
["Appenzelloise Barbue          ","320400",false,"1","",1,"","",""]
["Appenzelloise Barbue Bleue    ","320403",false,"1","",1,"","",""]
["Appenzelloise Barbue Noire    ","320401",false,"1","",1,"","",""]
["Appenzelloise Huppee          ","320500",false,"1","",1,"","",""]
["Appenzelloise Huppee Argentee ","320501",false,"1","",1,"","",""]
["Appenzelloise Huppee Doree    ","320502",false,"1","",1,"","",""]
["Appenzelloise Huppee Noire    ","320503",false,"1","",1,"","",""]
["Aquitaine                     ","310200",false,"1","",1,"","",""]
["Araucana","320608",false,"3","",1,"","",""]
["Araucans                      ","320600",false,"1","",1,"","",""]
["Araucans Blanche              ","320607",false,"1","",1,"","",""]
["Araucans Bleue                ","320602",false,"1","",1,"","",""]
["Araucans Coucou               ","320606",false,"1","",1,"","",""]
["Araucans Doree                ","320601",false,"1","",1,"","",""]
["Araucans Fauve Dore           ","320603",false,"1","",1,"","",""]
["Araucans Froment              ","320604",false,"1","",1,"","",""]
["Araucans Noire                ","320605",false,"1","",1,"","",""]
["Ardennaise","310245",false,"4","",1,"","",""]
["Ardennaise A Camail Argente Gr","310254",false,"1","",1,"","",""]
["Ardennaise A Camail Dore      ","310253",false,"1","",1,"","",""]
["Ardennaise Argentee","310248",false,"6","",1,"","",""]
["Ardennaise Argentée N","330401",false,"1","",1,"","",""]
{"$rows_left_out":2372}
{"sheet":"T_RACE","index":2,"n_rows":2218,"n_cols":5,"rows_kept":2218,"cut":false,"hidden":true,"merged":[]}
["RacesFR","Num","RacesNL","NrCat","Pays"]
["Bélier Français",1,"Franse Hangoor","Lapins Géants","France"]
["Bélier Français Blanc Yeux Bleus",2,"Franse Hangoor Wit Blauwe Ogen","Lapins Géants","France"]
["Bélier Français Chinchilla",3,"Franse Hangoor Chinchilla","Lapins Géants","France"]
["Bélier Français Gris Bleu",4,"Franse Hangoor Blauw Grauw","Lapins Géants","France"]
["Bélier Français Gris Fer",5,"Franse Hangoor Ijzegrauw","Lapins Géants","France"]
["Bélier Français Gris Fer Bariolé",6,"Franse Hangoor Ijzergrauw Bont","Lapins Géants","France"]
["Bélier Français Gris Garenne",7,"Franse Hangoor Konijngrijs","Lapins Géants","France"]
["Bélier Français Gris Garenne Bariolé",8,"Franse Hangoor Konijngrijs Bont","Lapins Géants","France"]
["Bélier Français Madagascar",9,"Franse Hangoor Madagascar","Lapins Géants",""]
["Bélier Français Noir Bariolé",10,"Franse Hangoor Zwart Bont","Lapins Géants","France"]
["Blanc du Bouscat",11,"Wit van Bouscat","Lapins Géants","France"]
["Géant des Flandres",12,"Vlaamse Reus","Lapins Géants","Belgique"]
["Géant des Flandres Blanc",13,"Vlaamse Reus Wit","Lapins Géants","Belgique"]
["Géant des Flandres Bleu",14,"Vlaamse Reus Blauw","Lapins Géants","Belgique"]
["Géant des Flandres Chinchilla",15,"Vlaamse Reus Chinchilla","Lapins Géants","Belgique"]
["Géant des Flandres Gris Fer",16,"Vlaamse Reus Ijzergrauw","Lapins Géants","Belgique"]
["Géant des Flandres Gris Garenne",17,"Vlaamse Reus Konijngrijs","Lapins Géants","Belgique"]
["Géant des Flandres Gris Lièvre",18,"Vlaamse Reus Haasgrijs","Lapins Géants","Belgique"]
["Géant des Flandres Jaune",19,"Vlaamse Reus Geel","Lapins Géants","Belgique"]
["Géant des Flandres Noir",20,"Vlaamse Reus Zwart","Lapins Géants","Belgique"]
["Géant Papillon",21,"Reuze Vlinder","Lapins Géants","France"]
["Géant Papillon Bleu",22,"Reuze Vlinder Blauw","Lapins Géants","France"]
["Géant Papillon Havane",23,"Reuze Vlinder Havanna","Lapins Géants","France"]
["Géant Papillon Noir",24,"Reuze Vlinder Zwart","Lapins Géants","France"]
["Alaska",25,"Alaska","Lapins Moyens",""]
["Angora",26,"Angora","Lapins Moyens",""]
["Angora Noir",27,"Angora Zwart","Lapins Moyens",""]
["Argenté Belge",28,"Belgisch Zilver","Lapins Moyens","Belgique"]
["Argenté de Champagne",29,"Argenté de Champagne","Lapins Moyens","France"]
["Argenté de St-Hubert",30,"Argenté de St-Hubert","Lapins Moyens","Belgique"]
["Beige",31,"Beige","Lapins Moyens",""]
["Bélier Allemand Bariolé",32,"Duitse Hangoor Bont","Lapins Moyens","Allemagne"]
["Bélier Allemand Blanc",33,"Duitse Hangoor Wit","Lapins Moyens","Allemagne"]
["Bélier Allemand Blanc Yeux Bleus",34,"Duitse Hangoor Wit Blauwe Ogen","Lapins Moyens","Allemagne"]
["Bélier Allemand Blanc Yeux Rouges",35,"Duitse Hangoor Wit Rode Ogen","Lapins Moyens","Allemagne"]
["Bélier Allemand Chinchilla",36,"Duitse Hangoor Chinchilla","Lapins Moyens","Allemagne"]
["Bélier Allemand Gris Garenne",37,"Duitse Hangoor Konijngrijs","Lapins Moyens","Allemagne"]
["Bélier Allemand Madagascar",38,"Duitse Hangoor Madagascar","Lapins Moyens","Allemagne"]
["Bélier Anglais Gris Garenne",39,"Engelse Hangoor Konijngrijs","Lapins Moyens","Angleterre"]
["Bélier Anglais Noir",40,"Engelse Hangoor Zwart","Lapins Moyens","Angleterre"]
["Bélier Meissner",41,"Meissner Hanghoor","Lapins Moyens",""]
["Bélier Meissner Bleu",42,"Meissner Hangoor Blauw","Lapins Moyens",""]
["Bélier Meissner Noir",43,"Meissner Hangoor Zwart","Lapins Moyens",""]
["Beveren Blanc",44,"Van Beveren Wit","Lapins Moyens","Belgique"]
["Beveren Bleu",45,"Van Beveren Blauw","Lapins Moyens","Belgique"]
["Beveren Noir",46,"Van Beveren Zwart","Lapins Moyens","Belgique"]
["Blanc de Hotot",47,"Witte van Hotot","Lapins Moyens","Belgique"]
["Blanc de Termonde",48,"Wit van Dendermonde","Lapins Moyens",""]
["Blanc de Vienne",49,"Wener Wit","Lapins Moyens",""]
["Bleu de Ham",50,"Blauw van Ham","Lapins Moyens","Belgique"]
["Bleu de St-Nicolas",51,"Blauw van St.-Niklaas","Lapins Moyens","Belgique"]
["Californian",52,"Californiaan","Lapins Moyens",""]
["Californian Brun",53,"Californiaan Bruin","Lapins Moyens",""]
["Chamois de Thuringe",54,"Thuringer","Lapins Moyens",""]
["Deilenaar",55,"Deilenaar","Lapins Moyens",""]
["Doré de Saxe",56,"Doré de Saxe","Lapins Moyens",""]
["Fauve de Bourgogne",57,"Vaal van Bourgondië","Lapins Moyens","France"]
["Fée de Marbourg",58,"Marburger Feh","Lapins Moyens",""]
["Gouwenaar",59,"Gouwenaar","Lapins Moyens",""]
["Grand Argenté Allemand",60,"Groot Duitse Zilver","Lapins Moyens",""]
["Grand Argenté Clair",61,"Licht Groot Zilver","Lapins Moyens",""]
["Grand Chinchilla",62,"Groot Chinchilla","Lapins Moyens",""]
["Gris de l'Artois",63,"Gris de l'Artois","Lapins Moyens",""]
["Gris du Bourbonnais",64,"Gris du Bourbonnais","Lapins Moyens","France"]
["Havane",65,"Havanna","Lapins Moyens","France"]
["Japonais",66,"Japanner","Lapins Moyens",""]
["Lapin Normand",67,"Lapin Normand","Lapins Moyens","France"]
["Lapin Renard",68,"Voskonijn","Lapins Moyens",""]
["Lapin Rhön",69,"Rhön Konijn","Lapins Moyens",""]
["Lièvre Belge",70,"Belgische Haas","Lapins Moyens","Belgique"]
["Lièvre Belge Blanc",71,"Belgische Haas Wit","Lapins Moyens",""]
["Lièvre Belge Couleur Lièvre",72,"Belgische Haas Haaskleur","Lapins Moyens",""]
["Lièvre Belge Feu Noir",73,"Belgische Haas Tan Zwart","Lapins Moyens",""]
["Lièvre Belge Noir",74,"Belgische Haas Zwart","Lapins Moyens",""]
["Néo-Zélandais",75,"Nieuw-Zeelander","Lapins Moyens",""]
["Néo-Zélandais Blanc",76,"Nieuw-Zeelander Wit","Lapins Moyens",""]
["Néo-Zélandais Rouge",77,"Nieuw-Zeelander Rood","Lapins Moyens",""]
["Noir de Vienne",78,"Wener Zwart","Lapins Moyens",""]
["Papillon Rhénan",79,"Rijnlander","Lapins Moyens",""]
{"$rows_left_out":2139}
{"sheet":"T_RACE_VLOOKUP","index":3,"n_rows":2218,"n_cols":5,"rows_kept":2218,"cut":false,"hidden":true,"merged":[]}
["RacesFR","Num","RacesNL","NrCat","Pays"]
["African Owl Blanc",662,"Afrikaanse Meeuw Wit","Pigeons de Fantaisie",""]
["Ailes Colorées de Thuringe",663,"Thüringer Vleugelduif","Pigeons de Fantaisie","Allemagne"]
["Alaska",25,"Alaska","Lapins Moyens",""]
["Alouette Bernoise Alouette",664,"Berner Leeuwerik Geleewerikt","Pigeons de Fantaisie","Allemagne"]
["Alouette de Cobourg",362,"Coburgse Leeuwerik","Pigeons de Produit","Allemagne"]
["Alouette de Cobourg Barrée",363,"Coburger Leeuwerik Geband","Pigeons de Produit",""]
["Alouette de Cobourg Ecaillée",364,"Coburger Leeuwerik Gekrast","Pigeons de Produit",""]
["Alouette de Cobourg Unie",365,"Coburger Leeuwerik Holvleugel","Pigeons de Produit",""]
["Alouette de Nuremberg",665,"Neurenberger Leeuwerik","Pigeons de Fantaisie",""]
["Alouette de Nuremberg Barrée",666,"Nurnberger Leeuwerik Geband","Pigeons de Fantaisie",""]
["Alouette de Nurenberg Ecaillé",667,"Neurenberger Leeuwerik Geleeuwerikt","Pigeons de Fantaisie",""]
["Alpaca",286,"Alpaca","Cobayes",""]
["American Buff",1967,"Amerikaanse Buffgans","Palmipèdes",""]
["Amrock Barré",1483,"Amrock Gestreept","Volailles Naines",""]
["Ancien Cravaté Hollandais Blanc",668,"Oud-Hollandse Meeuw Wit","Pigeons de Fantaisie","Hollande"]
["Ancien Cravaté Hollandais Bleu Barré",669,"Oud-Hollandse Meeuw Blauw Geband","Pigeons de Fantaisie","Hollande"]
["Ancien Cravaté Hollandais Jaune Cendré Barré",670,"Oud-Hollandse Meeuw Geelzilver Geband","Pigeons de Fantaisie","Hollande"]
["Ancien Cravaté Hollandais Rouge",671,"Ous Hollandse Meeuw Rood","Pigeons de Fantaisie",""]
["Ancien Cravaté Hollandais Rouge Cendré Barré",672,"Oud-Hollandse Meeuw Roodzilver Geband","Pigeons de Fantaisie","Hollande"]
["Ancien Cravaté Oriental  Satinette Bleu Liseré",673,"Oud-Oosterse Meeuw Satinet Blauwgezoomd","Pigeons de Fantaisie",""]
["Ancien Cravaté Oriental Argenté Barré Blanc",674,"Oud-Oosterse Meeuw Blauwzilver Witgeband","Pigeons de Fantaisie",""]
["Ancien Cravaté Oriental Argenté Maillé Blanc",675,"Oud-Oosterse Meeuw Blauwzilver Witgeschubd","Pigeons de Fantaisie",""]
["Ancien Cravaté Oriental Blondinet Bluette",676,"Oud-Oosterse Meeuw Blondinet Bluette","Pigeons de Fantaisie",""]
["Ancien Cravaté Oriental Blondinet Brunette",677,"Oud-Oosterse Meeuw Blondinet Brunette","Pigeons de Fantaisie",""]
["Ancien Cravaté Oriental Lavande",678,"Oud-Oosterse Meeuw Lavandel","Pigeons de Fantaisie",""]
["Ancien Cravaté Oriental Noir Liseré",679,"Oud-Oosterse Meeuw Zwart Gezoomd","Pigeons de Fantaisie",""]
["Ancien Cravaté Oriental Sat. Bleu Barré Blanc",680,"Oud-Oosterse Meeuw Sat. Blauw Witgeband","Pigeons de Fantaisie",""]
["Ancien Cravaté Oriental Sat. Bleu Maillé Blanc",681,"Oud-Oosterse Meeuw Satinet Blauw Witgeschubd","Pigeons de Fantaisie",""]
["Ancien Cravaté Oriental Sat. Brun Barré Blanc",682,"Oud-Oosterse Meeuw Sat. Bruin Witgeband","Pigeons de Fantaisie",""]
["Ancien Cravaté Oriental Sat. Brun Maillé Blanc",683,"Oud-Oosterse Meeuw Sat. Bruin Witgeschubd","Pigeons de Fantaisie",""]
["Ancien Cravaté Oriental Sat. Jaune Cendré Barré",684,"Oud-Oosterse Meeuw Satinet Geelzilver Geband","Pigeons de Fantaisie",""]
["Ancien Cravaté Oriental Sat. Rouge Cendré Barré",685,"Oud-Oosterse Meeuw Satinet Roodzilver Geband","Pigeons de Fantaisie",""]
["Ancien Cravaté Oriental Satinette argenté maillé",686,"Oud-Oosterse Meeuw Satinette blauwzilver geschubd","Pigeons de Fantaisie",""]
["Ancien Cravaté Oriental Satinette Bleu Barré Blanc",687,"Oud-Oosterse Meeuw Satinet Blauw Witgeband","Pigeons de Fantaisie",""]
["Ancien Cravaté Oriental Satinette Jaune Liseré",688,"Oud-Oosterse Meeuw Satinet Geelgezoomd","Pigeons de Fantaisie",""]
["Ancien Cravaté Oriental Satinette Rouge Liseré",689,"Oud-Oosterse Meeuw Satinet Rood Gezoomd","Pigeons de Fantaisie",""]
["Ancien Culbutant Autrichien Bleu Barré Noir",690,"Oud Oostenrijkse Tuimelaar Blauw Zwartgeband","Pigeons de Fantaisie",""]
["Angora",26,"Angora","Lapins Moyens",""]
["Angora Blanc",287,"Angora Wit","Cobayes",""]
["Angora Nain Blanc Yeux Rouges",178,"Angoradwerg Wit Rode Ogen","Lapins Nains",""]
["Angora Nain Noir",179,"Angoradwerg Zwart","Lapins Nains",""]
["Angora Noir",27,"Angora Zwart","Lapins Moyens",""]
["Angora Noir Blanc",288,"Angora Zwart Wit","Cobayes",""]
["Angora Tricolore",289,"Angora Driekleur","Cobayes",""]
["Anserelle de Coromandel",1968,"Coromandel dwergeend","Palmipèdes",""]
["Anserelle élégante",1969,"Australische dwergeend","Palmipèdes",""]
["Anserelle naine ou d'Afrique",1970,"Afrikaanse dwergeend","Palmipèdes",""]
["Appenzelloise Barbue Noire",1484,"Gebaarde Appenzeller Zwart","Volailles Naines",""]
["Appenzelloise Huppée Argenté Pointé Noir",1275,"Appenzeller Spitskuif Zilver Zwartgetoept","Grandes Volailles",""]
["Appenzelloise Huppée Doré Pointé Noir",1276,"Appenzeller Spitskuif Goud Zwartgetoept","Grandes Volailles",""]
["Araucana",1277,"Araucana","Grandes Volailles",""]
["Araucana Bleu Doré",1278,"Araucana Blauwpatrijs","Grandes Volailles",""]
["Araucana Couleur Sauvage",1279,"Araucana Wildkleur","Grandes Volailles",""]
["Araucana Froment",1280,"Araucana Tarwekleur","Grandes Volailles",""]
["Araucana Saumon Doré",1281,"Araucana Patrijs","Grandes Volailles",""]
["Ardennaise",1485,"Ardenner","Volailles Naines","Belgique"]
["Ardennaise Bleu à Camail Argenté",1486,"Ardenner Blauw Zilverhalzig","Volailles Naines",""]
["Ardennaise Bleu à Camail Doré",1282,"Ardenner Blauw Goudhalzig","Grandes Volailles",""]
["Ardennaise Bleu à Camail Doré",1487,"Ardenner Blauw Goudhalzig","Volailles Naines",""]
["Ardennaise Bleu Doré",1283,"Ardenner Blauwpatrijs","Grandes Volailles","Belgique"]
["Ardennaise Noir",1488,"Ardenner Zwart","Volailles Naines","Belgique"]
["Ardennaise Noir à Camail Argenté",1489,"Ardenner Zwart Zilverhalzig","Volailles Naines","Belgique"]
["Ardennaise Noir à Camail Doré",1490,"Ardenner Zwart Goudhalzig","Volailles Naines","Belgique"]
["Ardennaise Noir à Camail Doré et Poit. Lis.",1491,"Ardense Goudberken","Volailles Naines","Belgique"]
["Ardennaise Noir Camail Argenté Poit. Liserée",1492,"Ardenner Zilverberken","Volailles Naines","Belgique"]
["Ardennaise Noir Liseré Argenté",1284,"Ardenner Zwart Zilvergezoomd","Grandes Volailles","Belgique"]
["Ardennaise Noir Liseré Argenté",1493,"Ardenner Zwart Zilvergezoomd","Volailles Naines","Belgique"]
["Ardennaise Noir Liseré Doré",1285,"Ardenner Zwart Goudgezoomd","Grandes Volailles",""]
["Ardennaise Noire",1286,"Ardenner Zwart","Grandes Volailles","Belgique"]
["Ardennaise Noire à Camail Arg. Poit. Lis.",1287,"Ardenner Zilverberken","Grandes Volailles","Belgique"]
["Ardennaise Noire à Camail Argenté",1288,"Ardenner Zwart Zilverhalzig","Grandes Volailles","Belgique"]
["Ardennaise Noire à Camail Doré",1289,"Ardenner Zwart Goudhalzig","Grandes Volailles","Belgique"]
["Ardennaise Noire à Camail Doré Poit. Lis.",1290,"Ardenner Geelberken","Grandes Volailles","Belgique"]
["Ardennaise Saumon Argenté",1291,"Ardenner Zilverpatrijs","Grandes Volailles","Belgique"]
["Ardennaise Saumon Argenté",1494,"Ardenner Zilverpatrijs","Volailles Naines","Belgique"]
["Ardennaise Saumon Doré",1292,"Ardenner Patrijs","Grandes Volailles","Belgique"]
["Ardennaise Saumon Doré",1495,"Ardenner Patrijs","Volailles Naines","Belgique"]
["Ardennaise Saumon Doré Clair",1496,"Ardenner Geelpatrijs","Volailles Naines","Belgique"]
["Argenté Anglais",128,"Engels Zilver","Lapins Petits","Angleterre"]
{"$rows_left_out":2139}
{"sheet":"Combo","index":4,"n_rows":8,"n_cols":3,"rows_kept":8,"cut":false,"hidden":true,"merged":[]}
["Male / Femelle","Jeune/Adulte"]
["M","J","VN"]
["F","A","VG"]
[null,null,"Lapins"]
[null,null,"Cobayes"]
[null,null,"Pigeons"]
[null,null,"Aquatiques"]
[null,null,"Oiseaux de Parc"]

{"sheet":"InsDet","index":5,"n_rows":21,"n_cols":6,"rows_kept":21,"cut":false,"hidden":true,"merged":[]}
["N°race","RacesFR","Bague","Prix","Sexe"]
[{"$f":"VLOOKUP(Inscription!C4,Tableau24[[#All],[RacesFR]:[Num]],2)","v":{"$error":"#N/A"}},{"$f":"Inscription!C4","v":0},{"$f":"Inscription!F4","v":0},{"$f":"Inscription!G4","v":0},{"$f":"Inscription!D4&Inscription!E4","v":""},{"$f":"Inscription!$G$1&\"_\"&Inscription!$G$2","v":"Briatte _Vincent"}]
[{"$f":"VLOOKUP(Inscription!C5,Tableau24[[#All],[RacesFR]:[Num]],2)","v":{"$error":"#N/A"}},{"$f":"Inscription!C5","v":0},{"$f":"Inscription!F5","v":0},{"$f":"Inscription!G5","v":0},{"$f":"Inscription!D5&Inscription!E5","v":""},{"$f":"Inscription!$G$1&\"_\"&Inscription!$G$2","v":"Briatte _Vincent"}]
[{"$f":"VLOOKUP(Inscription!C6,Tableau24[[#All],[RacesFR]:[Num]],2)","v":{"$error":"#N/A"}},{"$f":"Inscription!C6","v":0},{"$f":"Inscription!F6","v":0},{"$f":"Inscription!G6","v":0},{"$f":"Inscription!D6&Inscription!E6","v":""},{"$f":"Inscription!$G$1&\"_\"&Inscription!$G$2","v":"Briatte _Vincent"}]
[{"$f":"VLOOKUP(Inscription!C7,Tableau24[[#All],[RacesFR]:[Num]],2)","v":{"$error":"#N/A"}},{"$f":"Inscription!C7","v":0},{"$f":"Inscription!F7","v":0},{"$f":"Inscription!G7","v":0},{"$f":"Inscription!D7&Inscription!E7","v":""},{"$f":"Inscription!$G$1&\"_\"&Inscription!$G$2","v":"Briatte _Vincent"}]
[{"$f":"VLOOKUP(Inscription!C8,Tableau24[[#All],[RacesFR]:[Num]],2)","v":{"$error":"#N/A"}},{"$f":"Inscription!C8","v":0},{"$f":"Inscription!F8","v":0},{"$f":"Inscription!G8","v":0},{"$f":"Inscription!D8&Inscription!E8","v":""},{"$f":"Inscription!$G$1&\"_\"&Inscription!$G$2","v":"Briatte _Vincent"}]
[{"$f":"VLOOKUP(Inscription!C9,Tableau24[[#All],[RacesFR]:[Num]],2)","v":{"$error":"#N/A"}},{"$f":"Inscription!C9","v":0},{"$f":"Inscription!F9","v":0},{"$f":"Inscription!G9","v":0},{"$f":"Inscription!D9&Inscription!E9","v":""},{"$f":"Inscription!$G$1&\"_\"&Inscription!$G$2","v":"Briatte _Vincent"}]
[{"$f":"VLOOKUP(Inscription!C10,Tableau24[[#All],[RacesFR]:[Num]],2)","v":{"$error":"#N/A"}},{"$f":"Inscription!C10","v":0},{"$f":"Inscription!F10","v":0},{"$f":"Inscription!G10","v":0},{"$f":"Inscription!D10&Inscription!E10","v":""},{"$f":"Inscription!$G$1&\"_\"&Inscription!$G$2","v":"Briatte _Vincent"}]
[{"$f":"VLOOKUP(Inscription!C11,Tableau24[[#All],[RacesFR]:[Num]],2)","v":{"$error":"#N/A"}},{"$f":"Inscription!C11","v":0},{"$f":"Inscription!F11","v":0},{"$f":"Inscription!G11","v":0},{"$f":"Inscription!D11&Inscription!E11","v":""},{"$f":"Inscription!$G$1&\"_\"&Inscription!$G$2","v":"Briatte _Vincent"}]
[{"$f":"VLOOKUP(Inscription!C12,Tableau24[[#All],[RacesFR]:[Num]],2)","v":{"$error":"#N/A"}},{"$f":"Inscription!C12","v":0},{"$f":"Inscription!F12","v":0},{"$f":"Inscription!G12","v":0},{"$f":"Inscription!D12&Inscription!E12","v":""},{"$f":"Inscription!$G$1&\"_\"&Inscription!$G$2","v":"Briatte _Vincent"}]
[{"$f":"VLOOKUP(Inscription!C13,Tableau24[[#All],[RacesFR]:[Num]],2)","v":{"$error":"#N/A"}},{"$f":"Inscription!C13","v":0},{"$f":"Inscription!F13","v":0},{"$f":"Inscription!G13","v":0},{"$f":"Inscription!D13&Inscription!E13","v":""},{"$f":"Inscription!$G$1&\"_\"&Inscription!$G$2","v":"Briatte _Vincent"}]
[{"$f":"VLOOKUP(Inscription!C14,Tableau24[[#All],[RacesFR]:[Num]],2)","v":{"$error":"#N/A"}},{"$f":"Inscription!C14","v":0},{"$f":"Inscription!F14","v":0},{"$f":"Inscription!G14","v":0},{"$f":"Inscription!D14&Inscription!E14","v":""},{"$f":"Inscription!$G$1&\"_\"&Inscription!$G$2","v":"Briatte _Vincent"}]
[{"$f":"VLOOKUP(Inscription!C15,Tableau24[[#All],[RacesFR]:[Num]],2)","v":{"$error":"#N/A"}},{"$f":"Inscription!C15","v":0},{"$f":"Inscription!F15","v":0},{"$f":"Inscription!G15","v":0},{"$f":"Inscription!D15&Inscription!E15","v":""},{"$f":"Inscription!$G$1&\"_\"&Inscription!$G$2","v":"Briatte _Vincent"}]
[{"$f":"VLOOKUP(Inscription!C16,Tableau24[[#All],[RacesFR]:[Num]],2)","v":{"$error":"#N/A"}},{"$f":"Inscription!C16","v":0},{"$f":"Inscription!F16","v":0},{"$f":"Inscription!G16","v":0},{"$f":"Inscription!D16&Inscription!E16","v":""},{"$f":"Inscription!$G$1&\"_\"&Inscription!$G$2","v":"Briatte _Vincent"}]
[{"$f":"VLOOKUP(Inscription!C17,Tableau24[[#All],[RacesFR]:[Num]],2)","v":{"$error":"#N/A"}},{"$f":"Inscription!C17","v":0},{"$f":"Inscription!F17","v":0},{"$f":"Inscription!G17","v":0},{"$f":"Inscription!D17&Inscription!E17","v":""},{"$f":"Inscription!$G$1&\"_\"&Inscription!$G$2","v":"Briatte _Vincent"}]
[{"$f":"VLOOKUP(Inscription!C18,Tableau24[[#All],[RacesFR]:[Num]],2)","v":{"$error":"#N/A"}},{"$f":"Inscription!C18","v":0},{"$f":"Inscription!F18","v":0},{"$f":"Inscription!G18","v":0},{"$f":"Inscription!D18&Inscription!E18","v":""},{"$f":"Inscription!$G$1&\"_\"&Inscription!$G$2","v":"Briatte _Vincent"}]
[{"$f":"VLOOKUP(Inscription!C19,Tableau24[[#All],[RacesFR]:[Num]],2)","v":{"$error":"#N/A"}},{"$f":"Inscription!C19","v":0},{"$f":"Inscription!F19","v":0},{"$f":"Inscription!G19","v":0},{"$f":"Inscription!D19&Inscription!E19","v":""},{"$f":"Inscription!$G$1&\"_\"&Inscription!$G$2","v":"Briatte _Vincent"}]
[{"$f":"VLOOKUP(Inscription!C20,Tableau24[[#All],[RacesFR]:[Num]],2)","v":{"$error":"#N/A"}},{"$f":"Inscription!C20","v":0},{"$f":"Inscription!F20","v":0},{"$f":"Inscription!G20","v":0},{"$f":"Inscription!D20&Inscription!E20","v":""},{"$f":"Inscription!$G$1&\"_\"&Inscription!$G$2","v":"Briatte _Vincent"}]
[{"$f":"VLOOKUP(Inscription!C21,Tableau24[[#All],[RacesFR]:[Num]],2)","v":{"$error":"#N/A"}},{"$f":"Inscription!C21","v":0},{"$f":"Inscription!F21","v":0},{"$f":"Inscription!G21","v":0},{"$f":"Inscription!D21&Inscription!E21","v":""},{"$f":"Inscription!$G$1&\"_\"&Inscription!$G$2","v":"Briatte _Vincent"}]
[{"$f":"VLOOKUP(Inscription!C22,Tableau24[[#All],[RacesFR]:[Num]],2)","v":{"$error":"#N/A"}},{"$f":"Inscription!C22","v":0},{"$f":"Inscription!F22","v":0},{"$f":"Inscription!G22","v":0},{"$f":"Inscription!D22&Inscription!E22","v":""},{"$f":"Inscription!$G$1&\"_\"&Inscription!$G$2","v":"Briatte _Vincent"}]
[{"$f":"VLOOKUP(Inscription!C23,Tableau24[[#All],[RacesFR]:[Num]],2)","v":{"$error":"#N/A"}},{"$f":"Inscription!C23","v":0},{"$f":"Inscription!F23","v":0},{"$f":"Inscription!G23","v":0},{"$f":"Inscription!D23&Inscription!E23","v":""},{"$f":"Inscription!$G$1&\"_\"&Inscription!$G$2","v":"Briatte _Vincent"}]